id,time,age,gender,country,education,Perceived_health_status,chronic_disease,disease,Weight_kg,Hight_cm,Smoking,flu_vaccine_past,optional_vaccine_past,diagnosed_Covid19,symptoms_severity,hospitalization_Covid19,vaccine_intention,vaccine_type,CV_FEAR1,CV_FEAR2,CV_FEAR3,CV_FEAR4,CV_FEAR5,CV_FEAR6,CV_FEAR7,CV_FEAR8,CV_FEAR9,CV_FEAR10,CV_FEAR11,CV_FEAR12,CV_FEAR13,CV_FEAR14,CV_skept1,CV_skept2,CV_skept3,CV_skept4,CV_skept5,CV_skept6,CV_skept7,CV_skept8,CV_skept9,CV_skept10,CV_skept11,CV_risk1,CV_risk2,CV_risk3,CV_risk4,CV_risk5,CV_risk6,CV_risk7,CV_risk8,CV_risk9,CV_risk10,CV_risk11,CV_risk12,Scepticism,Risk,Fear,Vaccine_hesitancy_total,country_merged,vaccine_intention_merged
1214.0,5/31/2021 12:32:39,28.0,1.0,5.0,6.0,4.0,0.0,,54.0,160.0,1.0,0.0,0.0,0.0,,,2.0,,3.0,1.0,2.0,1.0,1.0,1.0,1.0,1.0,1.0,1.0,1.0,3.0,1.0,2.0,4.0,4.0,4.0,4.0,3.0,4.0,4.0,2.0,3.0,2.0,2.0,3.0,2.0,3.0,2.0,2.0,3.0,2.0,2.0,2.0,2.0,2.0,2.0,10.0,14.0,4.0,28.0,3.0,3.0
761.0,5/18/2021 19:33:14,33.0,1.0,5.0,6.0,3.0,0.0,,55.0,163.0,0.0,0.0,1.0,0.0,,,2.0,,4.0,4.0,4.0,3.0,4.0,1.0,2.0,2.0,1.0,1.0,1.0,4.0,4.0,4.0,4.0,4.0,4.0,5.0,5.0,4.0,5.0,1.0,3.0,2.0,1.0,4.0,2.0,4.0,3.0,1.0,5.0,5.0,2.0,2.0,2.0,1.0,1.0,8.0,15.0,6.0,29.0,3.0,3.0
1464.0,6/4/2021 7:53:00,33.0,1.0,5.0,7.0,4.0,0.0,,105.0,172.0,0.0,0.0,0.0,0.0,,0.0,2.0,,3.0,1.0,1.0,1.0,1.0,1.0,1.0,2.0,1.0,2.0,1.0,1.0,3.0,1.0,1.0,1.0,3.0,2.0,1.0,1.0,1.0,1.0,4.0,5.0,4.0,3.0,3.0,4.0,3.0,5.0,4.0,3.0,5.0,5.0,3.0,4.0,5.0,22.0,20.0,6.0,48.0,3.0,3.0
1106.0,5/30/2021 11:04:21,36.0,1.0,5.0,6.0,4.0,0.0,,70.0,163.0,1.0,1.0,1.0,1.0,3.0,0.0,2.0,,3.0,1.0,1.0,4.0,5.0,1.0,1.0,1.0,1.0,1.0,1.0,5.0,3.0,4.0,2.0,3.0,3.0,3.0,3.0,3.0,4.0,4.0,4.0,4.0,2.0,3.0,3.0,5.0,5.0,5.0,5.0,5.0,4.0,3.0,3.0,3.0,2.0,15.0,26.0,4.0,45.0,3.0,3.0
900.0,5/29/2021 20:09:26,39.0,0.0,5.0,4.0,5.0,0.0,,75.0,180.0,1.0,0.0,1.0,0.0,,,2.0,,1.0,1.0,1.0,1.0,1.0,1.0,1.0,1.0,1.0,1.0,1.0,1.0,1.0,1.0,1.0,2.0,5.0,3.0,2.0,3.0,1.0,1.0,5.0,1.0,1.0,3.0,1.0,3.0,1.0,3.0,3.0,2.0,5.0,4.0,1.0,3.0,5.0,18.0,14.0,4.0,36.0,3.0,3.0
71.0,5/4/2021 21:56:00,27.0,0.0,5.0,5.0,4.0,0.0,,93.0,183.0,0.0,0.0,0.0,0.0,1.0,0.0,1.0,,1.0,1.0,1.0,1.0,1.0,1.0,1.0,1.0,1.0,1.0,1.0,1.0,1.0,1.0,1.0,1.0,1.0,1.0,1.0,1.0,1.0,1.0,1.0,5.0,5.0,1.0,1.0,1.0,1.0,1.0,1.0,1.0,5.0,5.0,5.0,5.0,5.0,25.0,6.0,4.0,35.0,3.0,1.0
1028.0,5/29/2021 23:38:05,30.0,0.0,5.0,4.0,4.0,0.0,,64.0,180.0,1.0,0.0,1.0,0.0,,,1.0,,5.0,5.0,5.0,1.0,1.0,5.0,4.0,1.0,1.0,1.0,1.0,5.0,2.0,5.0,3.0,1.0,2.0,4.0,4.0,1.0,1.0,3.0,1.0,5.0,3.0,1.0,1.0,1.0,5.0,3.0,1.0,1.0,3.0,5.0,4.0,2.0,5.0,19.0,14.0,7.0,40.0,3.0,1.0
967.0,5/29/2021 21:52:18,32.0,1.0,5.0,7.0,4.0,0.0,,86.0,171.0,1.0,0.0,1.0,0.0,,,1.0,,5.0,5.0,5.0,5.0,5.0,5.0,5.0,5.0,5.0,5.0,5.0,5.0,1.0,5.0,1.0,1.0,1.0,1.0,1.0,1.0,1.0,1.0,5.0,5.0,5.0,5.0,5.0,5.0,5.0,5.0,5.0,5.0,5.0,5.0,5.0,5.0,5.0,25.0,26.0,20.0,71.0,3.0,1.0
1448.0,6/3/2021 10:24:36,34.0,1.0,5.0,5.0,4.0,1.0,Pajzsmirigy elegtelenseg,85.0,159.0,0.0,1.0,1.0,1.0,1.0,0.0,1.0,,5.0,2.0,1.0,1.0,3.0,1.0,1.0,1.0,1.0,1.0,1.0,5.0,3.0,2.0,1.0,1.0,3.0,1.0,1.0,1.0,1.0,1.0,4.0,3.0,3.0,5.0,3.0,5.0,1.0,1.0,5.0,5.0,5.0,5.0,3.0,5.0,5.0,23.0,15.0,4.0,42.0,3.0,1.0
1331.0,5/31/2021 23:13:55,38.0,1.0,5.0,1.0,4.0,0.0,,73.0,162.0,0.0,0.0,0.0,0.0,,0.0,1.0,,5.0,5.0,5.0,5.0,5.0,3.0,5.0,3.0,3.0,3.0,2.0,5.0,3.0,5.0,1.0,1.0,1.0,1.0,1.0,1.0,1.0,2.0,4.0,4.0,4.0,5.0,5.0,5.0,5.0,5.0,5.0,5.0,5.0,5.0,5.0,5.0,5.0,25.0,26.0,14.0,65.0,3.0,1.0
952.0,5/29/2021 21:29:09,39.0,1.0,5.0,6.0,4.0,0.0,,70.0,165.0,1.0,0.0,0.0,0.0,,,1.0,,5.0,5.0,5.0,3.0,3.0,5.0,4.0,1.0,3.0,3.0,1.0,4.0,1.0,4.0,1.0,1.0,3.0,2.0,1.0,1.0,1.0,5.0,5.0,4.0,4.0,4.0,4.0,5.0,5.0,5.0,5.0,5.0,5.0,5.0,3.0,4.0,5.0,22.0,29.0,11.0,62.0,3.0,1.0
682.0,5/15/2021 17:48:24,40.0,0.0,5.0,5.0,5.0,0.0,,86.0,180.0,0.0,0.0,0.0,0.0,,,1.0,,3.0,4.0,3.0,3.0,3.0,1.0,1.0,1.0,1.0,1.0,1.0,4.0,3.0,4.0,1.0,1.0,1.0,1.0,1.0,1.0,1.0,3.0,4.0,3.0,4.0,4.0,3.0,5.0,4.0,3.0,3.0,3.0,5.0,5.0,5.0,5.0,5.0,25.0,20.0,4.0,49.0,3.0,1.0
1413.0,6/2/2021 0:02:27,41.0,1.0,5.0,3.0,5.0,0.0,,90.0,153.0,1.0,0.0,0.0,0.0,,,1.0,,5.0,5.0,1.0,5.0,5.0,1.0,5.0,1.0,1.0,1.0,1.0,5.0,5.0,5.0,1.0,1.0,1.0,3.0,1.0,1.0,1.0,5.0,5.0,5.0,5.0,5.0,5.0,5.0,3.0,5.0,4.0,5.0,5.0,5.0,5.0,3.0,5.0,23.0,27.0,8.0,58.0,3.0,1.0
94.0,5/4/2021 22:48:28,42.0,1.0,5.0,3.0,5.0,0.0,,74.0,169.0,0.0,0.0,0.0,1.0,2.0,0.0,1.0,,1.0,1.0,1.0,1.0,1.0,1.0,1.0,1.0,1.0,1.0,1.0,1.0,1.0,1.0,1.0,1.0,1.0,1.0,1.0,1.0,1.0,3.0,3.0,4.0,5.0,1.0,1.0,5.0,3.0,3.0,3.0,3.0,5.0,5.0,5.0,5.0,5.0,25.0,16.0,4.0,45.0,3.0,1.0
856.0,5/29/2021 19:25:07,42.0,1.0,5.0,6.0,5.0,0.0,,63.0,165.0,0.0,0.0,0.0,0.0,,,1.0,,4.0,4.0,4.0,3.0,3.0,1.0,2.0,1.0,2.0,2.0,1.0,5.0,3.0,3.0,1.0,1.0,1.0,1.0,1.0,1.0,1.0,3.0,3.0,4.0,4.0,3.0,3.0,4.0,3.0,2.0,2.0,1.0,5.0,5.0,5.0,5.0,5.0,25.0,16.0,7.0,48.0,3.0,1.0
986.0,5/29/2021 22:29:30,42.0,0.0,5.0,4.0,5.0,0.0,,92.0,182.0,0.0,1.0,1.0,1.0,2.0,0.0,1.0,,3.0,5.0,2.0,1.0,1.0,1.0,1.0,1.0,1.0,1.0,1.0,4.0,4.0,4.0,1.0,1.0,1.0,1.0,1.0,1.0,1.0,5.0,5.0,5.0,5.0,5.0,5.0,5.0,5.0,5.0,5.0,5.0,5.0,5.0,5.0,5.0,5.0,25.0,30.0,4.0,59.0,3.0,1.0
1042.0,5/30/2021 0:12:04,43.0,1.0,5.0,4.0,4.0,0.0,,56.0,166.0,0.0,0.0,1.0,0.0,,,1.0,,5.0,1.0,1.0,1.0,5.0,1.0,1.0,1.0,1.0,1.0,1.0,5.0,5.0,5.0,1.0,1.0,1.0,1.0,1.0,1.0,1.0,5.0,5.0,5.0,4.0,5.0,5.0,5.0,5.0,5.0,5.0,5.0,5.0,5.0,5.0,5.0,5.0,25.0,30.0,4.0,59.0,3.0,1.0
1421.0,6/2/2021 7:15:53,43.0,1.0,5.0,5.0,5.0,0.0,,65.0,175.0,0.0,0.0,1.0,1.0,3.0,0.0,1.0,,1.0,1.0,1.0,1.0,1.0,1.0,1.0,1.0,1.0,1.0,1.0,1.0,1.0,1.0,1.0,1.0,1.0,1.0,1.0,1.0,1.0,5.0,5.0,5.0,5.0,5.0,5.0,5.0,5.0,5.0,5.0,5.0,5.0,5.0,5.0,5.0,5.0,25.0,30.0,4.0,59.0,3.0,1.0
1061.0,5/30/2021 1:31:13,45.0,1.0,5.0,4.0,4.0,0.0,,116.0,173.0,0.0,0.0,1.0,1.0,3.0,0.0,1.0,,4.0,5.0,4.0,1.0,3.0,2.0,2.0,1.0,4.0,4.0,2.0,4.0,1.0,4.0,1.0,1.0,1.0,1.0,1.0,1.0,2.0,4.0,5.0,4.0,5.0,3.0,4.0,5.0,4.0,3.0,5.0,5.0,5.0,5.0,5.0,5.0,4.0,24.0,25.0,11.0,60.0,3.0,1.0
1274.0,5/31/2021 20:29:50,46.0,1.0,5.0,6.0,4.0,0.0,,75.0,175.0,0.0,0.0,1.0,0.0,,0.0,1.0,,1.0,3.0,1.0,1.0,1.0,1.0,1.0,1.0,1.0,1.0,1.0,5.0,5.0,1.0,1.0,1.0,1.0,1.0,1.0,1.0,1.0,1.0,5.0,3.0,5.0,5.0,5.0,5.0,5.0,5.0,5.0,5.0,5.0,5.0,5.0,5.0,5.0,25.0,26.0,4.0,55.0,3.0,1.0
1395.0,6/1/2021 17:25:55,46.0,1.0,5.0,4.0,4.0,1.0,Izületi,92.0,167.0,0.0,0.0,1.0,0.0,4.0,0.0,1.0,,5.0,5.0,5.0,5.0,5.0,5.0,5.0,1.0,5.0,1.0,1.0,5.0,2.0,4.0,1.0,1.0,1.0,1.0,1.0,1.0,1.0,2.0,5.0,5.0,5.0,5.0,5.0,5.0,3.0,4.0,4.0,5.0,5.0,5.0,5.0,5.0,5.0,25.0,23.0,12.0,60.0,3.0,1.0
1337.0,6/1/2021 0:02:23,53.0,1.0,5.0,6.0,5.0,0.0,,87.0,168.0,0.0,0.0,1.0,0.0,,0.0,1.0,,1.0,1.0,1.0,1.0,1.0,1.0,1.0,1.0,1.0,1.0,1.0,1.0,1.0,1.0,1.0,1.0,1.0,3.0,1.0,3.0,1.0,3.0,1.0,4.0,3.0,3.0,3.0,4.0,3.0,2.0,2.0,1.0,5.0,5.0,5.0,3.0,5.0,23.0,14.0,4.0,41.0,3.0,1.0
595.0,5/13/2021 19:21:29,55.0,1.0,5.0,8.0,5.0,1.0,,75.0,165.0,1.0,0.0,1.0,0.0,,,1.0,,1.0,1.0,1.0,1.0,1.0,1.0,1.0,1.0,1.0,1.0,1.0,5.0,5.0,1.0,1.0,1.0,1.0,1.0,1.0,1.0,1.0,1.0,5.0,5.0,5.0,5.0,5.0,5.0,5.0,5.0,5.0,5.0,5.0,5.0,5.0,5.0,5.0,25.0,26.0,4.0,55.0,3.0,1.0
1419.0,6/2/2021 1:45:20,55.0,1.0,5.0,4.0,3.0,1.0,Diabetes II,120.0,167.0,1.0,0.0,0.0,0.0,,,1.0,,5.0,5.0,5.0,5.0,5.0,5.0,5.0,5.0,5.0,5.0,5.0,5.0,3.0,5.0,1.0,1.0,1.0,1.0,1.0,1.0,5.0,5.0,5.0,5.0,5.0,1.0,3.0,5.0,3.0,5.0,5.0,3.0,5.0,5.0,5.0,5.0,1.0,21.0,26.0,20.0,67.0,3.0,1.0
897.0,5/29/2021 20:05:50,66.0,1.0,5.0,4.0,4.0,0.0,,67.0,168.0,0.0,0.0,1.0,0.0,,,1.0,,5.0,5.0,5.0,5.0,5.0,1.0,5.0,4.0,4.0,4.0,4.0,4.0,5.0,4.0,1.0,1.0,1.0,1.0,1.0,1.0,1.0,5.0,5.0,5.0,5.0,5.0,5.0,5.0,5.0,5.0,5.0,5.0,5.0,5.0,5.0,5.0,5.0,25.0,30.0,17.0,72.0,3.0,1.0
1155.0,5/30/2021 19:07:30,42.0,1.0,4.0,5.0,3.0,0.0,,73.0,147.0,0.0,0.0,0.0,0.0,,,2.0,,4.0,4.0,5.0,3.0,4.0,3.0,3.0,1.0,1.0,1.0,1.0,5.0,3.0,5.0,3.0,3.0,3.0,4.0,1.0,1.0,1.0,1.0,3.0,4.0,3.0,4.0,3.0,5.0,3.0,3.0,5.0,5.0,3.0,3.0,3.0,2.0,5.0,16.0,18.0,6.0,40.0,3.0,3.0
535.0,5/11/2021 16:49:14,46.0,1.0,4.0,5.0,4.0,0.0,"Eéggé hipochonder vagyok, de arra gyanakszo",77.0,165.0,0.0,1.0,1.0,0.0,,,2.0,,3.0,4.0,1.0,1.0,4.0,1.0,1.0,1.0,1.0,1.0,1.0,4.0,1.0,4.0,3.0,4.0,4.0,5.0,3.0,5.0,2.0,1.0,1.0,1.0,1.0,4.0,4.0,5.0,3.0,2.0,5.0,5.0,3.0,2.0,2.0,1.0,4.0,12.0,16.0,4.0,32.0,3.0,3.0
1367.0,6/1/2021 10:14:50,38.0,1.0,4.0,4.0,4.0,0.0,,63.0,164.0,0.0,0.0,0.0,0.0,,,1.0,,1.0,5.0,5.0,5.0,5.0,3.0,3.0,2.0,5.0,4.0,3.0,5.0,5.0,5.0,1.0,1.0,1.0,1.0,1.0,1.0,1.0,4.0,5.0,5.0,5.0,4.0,4.0,5.0,5.0,5.0,5.0,5.0,5.0,5.0,5.0,5.0,5.0,25.0,28.0,14.0,67.0,3.0,1.0
955.0,5/29/2021 21:32:37,39.0,1.0,4.0,5.0,4.0,0.0,,60.0,163.0,0.0,0.0,0.0,0.0,,,1.0,,1.0,2.0,1.0,2.0,2.0,1.0,2.0,1.0,1.0,1.0,2.0,5.0,5.0,5.0,1.0,1.0,1.0,1.0,1.0,1.0,1.0,5.0,4.0,5.0,5.0,5.0,3.0,5.0,5.0,5.0,5.0,5.0,5.0,5.0,5.0,5.0,5.0,25.0,27.0,5.0,57.0,3.0,1.0
979.0,5/29/2021 22:14:02,43.0,1.0,4.0,5.0,5.0,0.0,,72.0,172.0,0.0,0.0,0.0,1.0,3.0,0.0,1.0,,1.0,1.0,1.0,1.0,1.0,1.0,2.0,1.0,1.0,1.0,1.0,1.0,1.0,1.0,1.0,1.0,1.0,1.0,1.0,1.0,3.0,1.0,3.0,1.0,3.0,1.0,1.0,1.0,5.0,1.0,1.0,1.0,5.0,5.0,5.0,5.0,3.0,23.0,12.0,5.0,40.0,3.0,1.0
1019.0,5/29/2021 23:24:51,48.0,1.0,4.0,4.0,3.0,0.0,,65.0,156.0,0.0,0.0,0.0,0.0,,,1.0,,4.0,5.0,3.0,3.0,3.0,1.0,1.0,1.0,3.0,3.0,1.0,3.0,5.0,1.0,1.0,1.0,3.0,1.0,1.0,1.0,1.0,3.0,3.0,4.0,4.0,1.0,1.0,1.0,1.0,1.0,1.0,1.0,5.0,5.0,3.0,5.0,5.0,23.0,10.0,8.0,41.0,3.0,1.0
1373.0,6/1/2021 11:34:20,63.0,1.0,4.0,5.0,5.0,0.0,,49.0,160.0,1.0,0.0,1.0,0.0,,,1.0,,5.0,5.0,1.0,1.0,1.0,5.0,5.0,1.0,5.0,5.0,1.0,5.0,5.0,5.0,1.0,1.0,1.0,1.0,1.0,1.0,1.0,5.0,5.0,5.0,5.0,5.0,5.0,5.0,5.0,5.0,5.0,5.0,5.0,5.0,5.0,5.0,5.0,25.0,30.0,16.0,71.0,3.0,1.0
1480.0,6/5/2021 1:06:10,37.0,1.0,3.0,5.0,5.0,0.0,,81.0,164.0,1.0,0.0,1.0,1.0,3.0,0.0,2.0,,4.0,4.0,4.0,4.0,5.0,4.0,4.0,1.0,1.0,1.0,1.0,5.0,5.0,5.0,3.0,2.0,2.0,3.0,1.0,1.0,1.0,1.0,3.0,1.0,3.0,3.0,3.0,5.0,3.0,3.0,3.0,3.0,3.0,4.0,4.0,3.0,5.0,19.0,16.0,7.0,42.0,3.0,3.0
1012.0,5/29/2021 23:12:18,43.0,1.0,3.0,5.0,4.0,0.0,,90.0,165.0,0.0,0.0,1.0,0.0,,,2.0,,3.0,4.0,4.0,3.0,2.0,3.0,3.0,2.0,2.0,1.0,2.0,1.0,1.0,3.0,5.0,5.0,5.0,5.0,3.0,3.0,4.0,1.0,1.0,1.0,1.0,1.0,1.0,2.0,3.0,1.0,4.0,3.0,1.0,1.0,1.0,1.0,2.0,6.0,11.0,8.0,25.0,3.0,3.0
131.0,5/5/2021 7:52:02,30.0,1.0,3.0,4.0,3.0,0.0,,75.0,168.0,1.0,0.0,1.0,0.0,,,1.0,,5.0,5.0,5.0,5.0,5.0,5.0,5.0,5.0,5.0,5.0,5.0,5.0,1.0,5.0,1.0,1.0,1.0,1.0,1.0,1.0,1.0,5.0,5.0,5.0,5.0,5.0,5.0,5.0,5.0,5.0,5.0,5.0,5.0,5.0,5.0,5.0,5.0,25.0,30.0,20.0,75.0,3.0,1.0
460.0,5/7/2021 23:11:33,31.0,1.0,3.0,4.0,4.0,1.0,Colitis Ulcerosa,58.0,175.0,1.0,0.0,0.0,0.0,,,1.0,,4.0,4.0,4.0,1.0,1.0,1.0,1.0,1.0,1.0,1.0,1.0,5.0,1.0,2.0,1.0,1.0,1.0,1.0,1.0,1.0,1.0,5.0,4.0,3.0,4.0,4.0,2.0,5.0,3.0,3.0,3.0,2.0,5.0,5.0,5.0,5.0,5.0,25.0,20.0,4.0,49.0,3.0,1.0
940.0,5/29/2021 21:08:23,41.0,1.0,3.0,6.0,4.0,0.0,,100.0,165.0,0.0,0.0,0.0,1.0,1.0,0.0,1.0,,2.0,5.0,4.0,1.0,1.0,2.0,2.0,1.0,4.0,3.0,2.0,3.0,4.0,2.0,1.0,1.0,1.0,3.0,1.0,1.0,2.0,4.0,4.0,4.0,5.0,5.0,3.0,5.0,4.0,4.0,4.0,4.0,5.0,5.0,5.0,3.0,4.0,22.0,23.0,10.0,55.0,3.0,1.0
1027.0,5/29/2021 23:36:51,48.0,1.0,3.0,3.0,4.0,0.0,,80.0,156.0,0.0,0.0,0.0,0.0,,,1.0,,5.0,5.0,1.0,3.0,3.0,1.0,1.0,2.0,2.0,2.0,2.0,5.0,4.0,3.0,1.0,1.0,2.0,1.0,1.0,1.0,3.0,5.0,5.0,5.0,5.0,5.0,5.0,5.0,5.0,5.0,5.0,5.0,5.0,5.0,4.0,5.0,3.0,22.0,30.0,7.0,59.0,3.0,1.0
510.0,5/10/2021 14:09:12,19.0,1.0,2.0,5.0,5.0,0.0,,62.0,169.0,0.0,0.0,0.0,0.0,,,8.0,,3.0,2.0,2.0,4.0,2.0,1.0,1.0,1.0,1.0,1.0,1.0,4.0,1.0,1.0,3.0,3.0,3.0,4.0,3.0,2.0,4.0,3.0,4.0,2.0,3.0,4.0,3.0,5.0,4.0,5.0,5.0,4.0,3.0,3.0,3.0,2.0,2.0,13.0,24.0,4.0,41.0,2.0,3.0
508.0,5/10/2021 14:08:59,23.0,0.0,2.0,4.0,4.0,0.0,,74.0,178.0,1.0,0.0,1.0,0.0,,,8.0,,4.0,4.0,1.0,1.0,1.0,4.0,2.0,1.0,2.0,1.0,1.0,4.0,3.0,1.0,2.0,3.0,2.0,3.0,2.0,2.0,2.0,4.0,4.0,4.0,4.0,1.0,3.0,4.0,3.0,2.0,3.0,2.0,4.0,3.0,4.0,3.0,4.0,18.0,19.0,6.0,43.0,2.0,3.0
1490.0,6/5/2021 12:12:27,43.0,1.0,2.0,5.0,4.0,0.0,,48.0,167.0,0.0,0.0,0.0,0.0,,0.0,7.0,,4.0,4.0,4.0,3.0,3.0,3.0,4.0,1.0,3.0,5.0,2.0,4.0,3.0,1.0,1.0,1.0,2.0,2.0,2.0,1.0,2.0,1.0,5.0,4.0,5.0,4.0,3.0,5.0,3.0,4.0,4.0,2.0,5.0,5.0,4.0,4.0,4.0,22.0,20.0,13.0,55.0,2.0,2.0
935.0,5/29/2021 20:58:58,50.0,1.0,2.0,6.0,4.0,0.0,,85.0,168.0,0.0,0.0,1.0,0.0,,,7.0,,3.0,2.0,1.0,1.0,1.0,1.0,1.0,1.0,1.0,1.0,1.0,2.0,3.0,1.0,4.0,4.0,3.0,4.0,4.0,3.0,4.0,2.0,3.0,3.0,2.0,3.0,3.0,3.0,3.0,3.0,5.0,3.0,2.0,2.0,3.0,2.0,2.0,11.0,19.0,4.0,34.0,2.0,2.0
284.0,5/5/2021 21:16:11,29.0,1.0,2.0,5.0,3.0,0.0,,49.0,147.0,0.0,0.0,1.0,0.0,,,6.0,,1.0,1.0,1.0,1.0,1.0,1.0,1.0,1.0,1.0,1.0,1.0,3.0,3.0,1.0,5.0,5.0,4.0,5.0,2.0,3.0,3.0,2.0,1.0,1.0,1.0,2.0,1.0,3.0,1.0,1.0,3.0,2.0,1.0,1.0,2.0,1.0,3.0,8.0,9.0,4.0,21.0,2.0,3.0
315.0,5/6/2021 1:13:38,20.0,1.0,2.0,4.0,4.0,0.0,,64.0,173.0,0.0,0.0,1.0,0.0,,,3.0,,3.0,4.0,1.0,1.0,1.0,1.0,1.0,1.0,1.0,1.0,1.0,3.0,5.0,1.0,3.0,3.0,3.0,5.0,1.0,1.0,2.0,1.0,4.0,1.0,1.0,3.0,2.0,5.0,3.0,3.0,2.0,1.0,3.0,3.0,3.0,1.0,4.0,14.0,15.0,4.0,33.0,2.0,3.0
1024.0,5/29/2021 23:32:27,31.0,1.0,2.0,5.0,4.0,0.0,,70.0,175.0,0.0,0.0,1.0,1.0,1.0,0.0,3.0,,1.0,1.0,1.0,2.0,2.0,1.0,1.0,1.0,1.0,1.0,1.0,2.0,2.0,1.0,5.0,5.0,4.0,5.0,4.0,3.0,3.0,3.0,3.0,1.0,2.0,2.0,2.0,2.0,2.0,2.0,1.0,1.0,1.0,1.0,2.0,1.0,3.0,8.0,13.0,4.0,25.0,2.0,3.0
1453.0,6/3/2021 13:10:35,37.0,1.0,2.0,4.0,4.0,1.0,Asztma,58.0,165.0,0.0,0.0,0.0,1.0,3.0,0.0,3.0,,3.0,4.0,4.0,4.0,4.0,1.0,2.0,1.0,1.0,1.0,1.0,1.0,1.0,3.0,3.0,3.0,2.0,4.0,3.0,3.0,2.0,3.0,3.0,3.0,3.0,3.0,3.0,3.0,3.0,3.0,3.0,3.0,3.0,3.0,4.0,2.0,4.0,16.0,18.0,5.0,39.0,2.0,3.0
384.0,5/6/2021 12:39:30,43.0,1.0,2.0,4.0,5.0,0.0,,64.0,168.0,0.0,0.0,1.0,0.0,,,3.0,,2.0,1.0,1.0,1.0,2.0,1.0,1.0,1.0,1.0,1.0,1.0,3.0,2.0,1.0,3.0,3.0,2.0,4.0,2.0,1.0,4.0,5.0,5.0,5.0,5.0,5.0,4.0,5.0,4.0,4.0,5.0,4.0,3.0,3.0,4.0,2.0,2.0,14.0,27.0,4.0,45.0,2.0,3.0
312.0,5/6/2021 0:37:42,49.0,0.0,2.0,5.0,3.0,1.0,"Hipetónia, obesitas",115.0,181.0,0.0,1.0,1.0,0.0,,,3.0,,3.0,1.0,3.0,1.0,2.0,1.0,1.0,1.0,1.0,1.0,1.0,3.0,2.0,1.0,4.0,4.0,4.0,5.0,1.0,1.0,4.0,1.0,4.0,1.0,1.0,3.0,2.0,2.0,1.0,1.0,2.0,1.0,2.0,2.0,2.0,1.0,2.0,9.0,11.0,4.0,24.0,2.0,3.0
92.0,5/4/2021 22:41:59,23.0,1.0,2.0,5.0,3.0,1.0,Szorongás,80.0,175.0,0.0,0.0,0.0,0.0,,,2.0,,5.0,5.0,5.0,1.0,1.0,5.0,5.0,5.0,5.0,5.0,3.0,5.0,5.0,3.0,1.0,3.0,3.0,3.0,2.0,1.0,1.0,2.0,2.0,3.0,3.0,3.0,3.0,5.0,5.0,2.0,3.0,5.0,5.0,3.0,3.0,3.0,5.0,19.0,17.0,20.0,56.0,2.0,3.0
428.0,5/7/2021 12:27:13,24.0,1.0,2.0,5.0,5.0,0.0,,62.0,174.0,1.0,0.0,1.0,0.0,,,2.0,,2.0,1.0,1.0,1.0,1.0,1.0,1.0,1.0,1.0,1.0,1.0,5.0,1.0,1.0,2.0,4.0,4.0,4.0,3.0,1.0,1.0,2.0,4.0,1.0,4.0,4.0,2.0,5.0,5.0,2.0,1.0,1.0,4.0,2.0,2.0,2.0,5.0,15.0,16.0,4.0,35.0,2.0,3.0
252.0,5/5/2021 16:06:59,25.0,1.0,2.0,5.0,4.0,1.0,Reflux,60.0,169.0,0.0,0.0,1.0,2.0,4.0,0.0,2.0,,4.0,5.0,5.0,2.0,4.0,3.0,4.0,3.0,2.0,3.0,2.0,5.0,1.0,4.0,1.0,2.0,1.0,2.0,2.0,1.0,1.0,2.0,3.0,2.0,1.0,5.0,3.0,5.0,2.0,2.0,2.0,3.0,5.0,4.0,5.0,4.0,5.0,23.0,14.0,12.0,49.0,2.0,3.0
1211.0,5/31/2021 11:39:37,28.0,1.0,2.0,6.0,3.0,0.0,,65.0,168.0,1.0,1.0,1.0,1.0,2.0,0.0,2.0,,2.0,2.0,3.0,4.0,2.0,1.0,1.0,1.0,1.0,1.0,1.0,3.0,3.0,1.0,4.0,4.0,3.0,4.0,4.0,2.0,3.0,2.0,4.0,5.0,2.0,1.0,1.0,4.0,3.0,1.0,2.0,1.0,2.0,2.0,3.0,2.0,3.0,12.0,13.0,4.0,29.0,2.0,3.0
203.0,5/5/2021 13:54:15,29.0,0.0,2.0,6.0,4.0,0.0,,74.0,174.0,0.0,0.0,1.0,0.0,,,2.0,,2.0,2.0,4.0,4.0,4.0,1.0,1.0,1.0,1.0,1.0,1.0,3.0,2.0,2.0,3.0,3.0,4.0,5.0,4.0,3.0,3.0,1.0,2.0,1.0,1.0,4.0,2.0,4.0,2.0,3.0,3.0,1.0,3.0,3.0,2.0,1.0,3.0,12.0,13.0,4.0,29.0,2.0,3.0
319.0,5/6/2021 7:15:39,30.0,0.0,2.0,5.0,5.0,0.0,,75.0,170.0,0.0,0.0,1.0,0.0,,,2.0,,1.0,2.0,1.0,1.0,2.0,1.0,1.0,1.0,1.0,1.0,1.0,1.0,5.0,1.0,1.0,1.0,3.0,1.0,1.0,1.0,1.0,5.0,5.0,5.0,5.0,4.0,3.0,5.0,2.0,1.0,5.0,3.0,5.0,5.0,3.0,5.0,5.0,23.0,21.0,4.0,48.0,2.0,3.0
1104.0,5/30/2021 10:58:14,31.0,1.0,2.0,5.0,4.0,0.0,,60.0,175.0,0.0,0.0,0.0,0.0,,,2.0,,2.0,2.0,3.0,1.0,2.0,1.0,1.0,1.0,1.0,1.0,1.0,3.0,1.0,2.0,1.0,1.0,2.0,1.0,2.0,2.0,1.0,2.0,5.0,3.0,3.0,1.0,1.0,2.0,1.0,1.0,2.0,2.0,5.0,5.0,4.0,5.0,5.0,24.0,12.0,4.0,40.0,2.0,3.0
1180.0,5/30/2021 22:04:44,31.0,1.0,2.0,6.0,4.0,0.0,,57.0,168.0,0.0,0.0,1.0,0.0,,,2.0,,3.0,4.0,1.0,4.0,4.0,1.0,1.0,1.0,1.0,1.0,1.0,5.0,3.0,3.0,1.0,1.0,2.0,1.0,1.0,1.0,3.0,1.0,4.0,1.0,3.0,1.0,3.0,4.0,3.0,5.0,2.0,4.0,5.0,5.0,4.0,5.0,3.0,22.0,18.0,4.0,44.0,2.0,3.0
1150.0,5/30/2021 18:21:22,32.0,1.0,2.0,5.0,3.0,1.0,"Hashimoto thyreoiditis, inzulin-rezisztencia",88.0,173.0,0.0,0.0,1.0,1.0,4.0,0.0,2.0,,3.0,4.0,3.0,3.0,3.0,2.0,3.0,2.0,3.0,3.0,4.0,2.0,2.0,3.0,3.0,3.0,3.0,4.0,2.0,2.0,2.0,3.0,3.0,3.0,2.0,2.0,4.0,3.0,5.0,4.0,5.0,3.0,3.0,3.0,3.0,2.0,4.0,15.0,24.0,11.0,50.0,2.0,3.0
290.0,5/5/2021 21:34:30,34.0,1.0,2.0,5.0,4.0,0.0,,78.0,175.0,0.0,0.0,1.0,1.0,1.0,0.0,2.0,,3.0,4.0,2.0,1.0,1.0,2.0,1.0,1.0,3.0,1.0,1.0,3.0,2.0,1.0,3.0,2.0,2.0,3.0,2.0,1.0,2.0,2.0,3.0,3.0,3.0,3.0,1.0,3.0,2.0,1.0,3.0,2.0,3.0,4.0,4.0,3.0,4.0,18.0,12.0,6.0,36.0,2.0,3.0
725.0,5/17/2021 20:54:33,34.0,0.0,2.0,4.0,5.0,0.0,,106.0,186.0,0.0,0.0,0.0,0.0,,,2.0,,2.0,3.0,2.0,4.0,3.0,1.0,1.0,1.0,1.0,1.0,1.0,1.0,1.0,1.0,3.0,5.0,4.0,5.0,2.0,1.0,1.0,5.0,4.0,5.0,4.0,5.0,4.0,3.0,1.0,2.0,3.0,2.0,3.0,1.0,2.0,1.0,5.0,12.0,19.0,4.0,35.0,2.0,3.0
1082.0,5/30/2021 8:40:29,35.0,1.0,2.0,6.0,5.0,0.0,,66.0,164.0,0.0,0.0,0.0,0.0,,,2.0,,1.0,1.0,1.0,1.0,1.0,1.0,1.0,1.0,1.0,1.0,1.0,1.0,1.0,1.0,3.0,4.0,4.0,1.0,3.0,3.0,4.0,1.0,3.0,1.0,1.0,3.0,1.0,1.0,1.0,1.0,1.0,1.0,3.0,2.0,2.0,5.0,2.0,14.0,8.0,4.0,26.0,2.0,3.0
906.0,5/29/2021 20:16:57,36.0,1.0,2.0,5.0,4.0,1.0,2es típusú cukorbetegség,96.0,170.0,0.0,0.0,0.0,1.0,3.0,0.0,2.0,,1.0,1.0,2.0,1.0,1.0,1.0,1.0,1.0,1.0,1.0,1.0,2.0,1.0,2.0,3.0,3.0,4.0,3.0,3.0,3.0,3.0,4.0,2.0,4.0,2.0,3.0,3.0,3.0,3.0,3.0,3.0,2.0,3.0,3.0,2.0,3.0,3.0,14.0,18.0,4.0,36.0,2.0,3.0
1483.0,6/5/2021 8:17:54,36.0,1.0,2.0,5.0,4.0,0.0,,90.0,169.0,0.0,0.0,1.0,1.0,1.0,0.0,2.0,,3.0,1.0,5.0,2.0,2.0,1.0,1.0,1.0,1.0,1.0,1.0,3.0,4.0,1.0,2.0,2.0,3.0,3.0,2.0,2.0,2.0,3.0,3.0,3.0,2.0,2.0,3.0,3.0,2.0,3.0,3.0,3.0,4.0,4.0,3.0,3.0,4.0,18.0,17.0,4.0,39.0,2.0,3.0
566.0,5/12/2021 23:57:17,39.0,1.0,2.0,5.0,4.0,0.0,,75.0,175.0,1.0,0.0,0.0,0.0,,,2.0,,3.0,3.0,1.0,2.0,3.0,1.0,1.0,1.0,1.0,1.0,1.0,3.0,4.0,4.0,2.0,3.0,3.0,3.0,2.0,2.0,3.0,4.0,3.0,4.0,3.0,3.0,2.0,3.0,2.0,3.0,2.0,2.0,4.0,3.0,3.0,3.0,3.0,16.0,16.0,4.0,36.0,2.0,3.0
1005.0,5/29/2021 23:01:44,39.0,1.0,2.0,5.0,4.0,0.0,,60.0,169.0,0.0,0.0,0.0,1.0,3.0,0.0,2.0,,3.0,1.0,1.0,1.0,2.0,1.0,1.0,1.0,1.0,1.0,1.0,2.0,3.0,1.0,3.0,3.0,3.0,4.0,3.0,3.0,3.0,1.0,2.0,3.0,3.0,1.0,1.0,2.0,1.0,1.0,1.0,1.0,3.0,3.0,3.0,2.0,3.0,14.0,7.0,4.0,25.0,2.0,3.0
1213.0,5/31/2021 12:06:34,39.0,1.0,2.0,5.0,3.0,0.0,,60.0,170.0,0.0,0.0,0.0,0.0,,0.0,2.0,,3.0,4.0,2.0,1.0,1.0,1.0,2.0,1.0,2.0,1.0,1.0,4.0,1.0,1.0,2.0,1.0,2.0,2.0,2.0,4.0,1.0,2.0,4.0,3.0,4.0,5.0,4.0,5.0,2.0,4.0,3.0,3.0,4.0,5.0,4.0,4.0,5.0,22.0,19.0,6.0,47.0,2.0,3.0
1047.0,5/30/2021 0:21:57,41.0,0.0,2.0,5.0,5.0,0.0,,78.0,183.0,0.0,0.0,1.0,1.0,4.0,0.0,2.0,,2.0,1.0,1.0,2.0,2.0,1.0,1.0,1.0,1.0,1.0,1.0,2.0,2.0,1.0,2.0,2.0,3.0,2.0,3.0,3.0,1.0,2.0,4.0,3.0,3.0,4.0,2.0,4.0,2.0,3.0,3.0,1.0,4.0,4.0,3.0,4.0,5.0,20.0,16.0,4.0,40.0,2.0,3.0
1090.0,5/30/2021 9:11:45,41.0,1.0,2.0,6.0,5.0,0.0,,58.0,174.0,0.0,0.0,1.0,0.0,,,2.0,,4.0,4.0,4.0,1.0,3.0,1.0,1.0,1.0,1.0,1.0,1.0,4.0,3.0,2.0,2.0,2.0,2.0,3.0,3.0,2.0,2.0,3.0,5.0,5.0,3.0,5.0,3.0,4.0,3.0,3.0,5.0,3.0,4.0,4.0,4.0,3.0,4.0,19.0,22.0,4.0,45.0,2.0,3.0
1375.0,6/1/2021 11:53:58,41.0,0.0,2.0,4.0,4.0,0.0,,82.0,170.0,0.0,1.0,1.0,2.0,2.0,0.0,2.0,,2.0,3.0,1.0,1.0,1.0,2.0,2.0,1.0,1.0,1.0,1.0,1.0,2.0,1.0,1.0,2.0,4.0,3.0,2.0,2.0,2.0,1.0,3.0,3.0,5.0,4.0,4.0,3.0,3.0,3.0,4.0,2.0,5.0,4.0,2.0,3.0,4.0,18.0,18.0,5.0,41.0,2.0,3.0
915.0,5/29/2021 20:26:03,42.0,1.0,2.0,5.0,4.0,1.0,Migrén,70.0,175.0,0.0,0.0,1.0,1.0,2.0,0.0,2.0,,4.0,2.0,5.0,4.0,4.0,1.0,1.0,1.0,1.0,1.0,1.0,4.0,1.0,1.0,3.0,4.0,4.0,2.0,2.0,1.0,1.0,1.0,3.0,1.0,4.0,1.0,5.0,4.0,4.0,3.0,3.0,1.0,3.0,2.0,2.0,4.0,5.0,16.0,19.0,4.0,39.0,2.0,3.0
997.0,5/29/2021 22:44:39,42.0,1.0,2.0,4.0,4.0,0.0,,101.0,164.0,0.0,0.0,0.0,1.0,3.0,0.0,2.0,,5.0,5.0,5.0,1.0,2.0,3.0,3.0,4.0,2.0,2.0,2.0,5.0,1.0,5.0,1.0,1.0,3.0,2.0,1.0,3.0,3.0,5.0,5.0,5.0,5.0,3.0,4.0,5.0,5.0,3.0,5.0,5.0,5.0,5.0,3.0,4.0,3.0,20.0,27.0,11.0,58.0,2.0,3.0
1209.0,5/31/2021 10:50:11,42.0,1.0,2.0,5.0,4.0,0.0,,57.0,165.0,0.0,0.0,0.0,0.0,,0.0,2.0,,5.0,5.0,3.0,3.0,4.0,4.0,4.0,2.0,4.0,5.0,5.0,5.0,5.0,4.0,1.0,1.0,1.0,2.0,2.0,1.0,1.0,5.0,5.0,3.0,4.0,3.0,5.0,5.0,5.0,5.0,4.0,4.0,5.0,5.0,5.0,4.0,5.0,24.0,29.0,15.0,68.0,2.0,3.0
75.0,5/4/2021 22:03:26,43.0,1.0,2.0,5.0,5.0,0.0,,65.0,180.0,0.0,0.0,0.0,1.0,1.0,0.0,2.0,,4.0,4.0,1.0,1.0,1.0,1.0,1.0,1.0,1.0,1.0,1.0,3.0,3.0,1.0,2.0,3.0,3.0,3.0,3.0,3.0,2.0,3.0,4.0,4.0,5.0,5.0,4.0,5.0,4.0,4.0,5.0,4.0,4.0,3.0,3.0,3.0,4.0,17.0,24.0,4.0,45.0,2.0,3.0
1384.0,6/1/2021 13:36:36,43.0,1.0,2.0,4.0,4.0,1.0,"Autoimmun betegségek, szív-érrendszeri bet",65.0,161.0,0.0,0.0,0.0,0.0,,,2.0,,2.0,2.0,1.0,1.0,2.0,1.0,2.0,1.0,2.0,2.0,2.0,2.0,1.0,1.0,2.0,2.0,3.0,2.0,3.0,3.0,1.0,2.0,1.0,2.0,2.0,2.0,2.0,2.0,3.0,1.0,3.0,2.0,4.0,4.0,3.0,4.0,5.0,20.0,12.0,7.0,39.0,2.0,3.0
1438.0,6/2/2021 21:54:49,43.0,1.0,2.0,7.0,4.0,0.0,,58.0,168.0,0.0,0.0,0.0,1.0,4.0,0.0,2.0,,1.0,1.0,1.0,3.0,1.0,1.0,1.0,1.0,1.0,1.0,1.0,2.0,1.0,1.0,4.0,5.0,5.0,5.0,3.0,5.0,5.0,2.0,3.0,1.0,1.0,1.0,1.0,3.0,1.0,1.0,1.0,1.0,2.0,1.0,1.0,1.0,1.0,6.0,9.0,4.0,19.0,2.0,3.0
619.0,5/14/2021 9:24:09,44.0,0.0,2.0,5.0,5.0,0.0,,74.0,180.0,0.0,1.0,1.0,1.0,2.0,0.0,2.0,,3.0,2.0,1.0,1.0,1.0,1.0,1.0,1.0,1.0,1.0,1.0,4.0,2.0,1.0,3.0,4.0,4.0,4.0,3.0,3.0,3.0,1.0,4.0,1.0,1.0,3.0,1.0,4.0,3.0,1.0,2.0,1.0,3.0,2.0,2.0,2.0,3.0,12.0,12.0,4.0,28.0,2.0,3.0
1023.0,5/29/2021 23:29:57,44.0,1.0,2.0,5.0,5.0,1.0,Pajzsmirigy alulműködés,57.6,162.0,0.0,0.0,1.0,0.0,,,2.0,,5.0,5.0,5.0,5.0,5.0,1.0,1.0,1.0,1.0,1.0,1.0,5.0,1.0,5.0,1.0,1.0,2.0,1.0,1.0,1.0,1.0,5.0,5.0,5.0,5.0,5.0,5.0,5.0,5.0,1.0,5.0,5.0,5.0,5.0,4.0,5.0,5.0,24.0,26.0,4.0,54.0,2.0,3.0
1424.0,6/2/2021 11:48:52,44.0,1.0,2.0,5.0,5.0,0.0,,57.0,154.0,1.0,0.0,0.0,0.0,,0.0,2.0,,5.0,5.0,5.0,1.0,3.0,1.0,1.0,1.0,1.0,1.0,1.0,5.0,5.0,5.0,1.0,1.0,1.0,3.0,1.0,2.0,1.0,3.0,5.0,5.0,4.0,5.0,3.0,5.0,3.0,5.0,5.0,5.0,5.0,5.0,5.0,3.0,5.0,23.0,24.0,4.0,51.0,2.0,3.0
551.0,5/12/2021 11:55:45,45.0,1.0,2.0,4.0,4.0,1.0,IR,60.0,175.0,0.0,0.0,0.0,0.0,,,2.0,,4.0,4.0,4.0,5.0,5.0,4.0,4.0,4.0,4.0,4.0,4.0,5.0,5.0,5.0,1.0,2.0,3.0,2.0,3.0,3.0,1.0,5.0,5.0,5.0,4.0,5.0,4.0,5.0,5.0,5.0,5.0,5.0,5.0,4.0,3.0,4.0,5.0,21.0,29.0,16.0,66.0,2.0,3.0
1339.0,6/1/2021 0:15:13,45.0,1.0,2.0,4.0,4.0,1.0,Pajzsmirigy alulműködés,82.0,167.0,1.0,0.0,1.0,0.0,,,2.0,,5.0,5.0,3.0,4.0,3.0,3.0,3.0,3.0,3.0,3.0,3.0,5.0,1.0,5.0,4.0,3.0,3.0,4.0,3.0,2.0,3.0,3.0,5.0,3.0,3.0,4.0,3.0,4.0,5.0,5.0,5.0,5.0,2.0,3.0,3.0,2.0,3.0,13.0,26.0,12.0,51.0,2.0,3.0
1405.0,6/1/2021 19:36:44,45.0,1.0,2.0,5.0,5.0,0.0,,90.0,175.0,1.0,0.0,0.0,0.0,,0.0,2.0,,1.0,5.0,3.0,1.0,1.0,1.0,1.0,1.0,1.0,3.0,1.0,5.0,3.0,5.0,1.0,1.0,1.0,1.0,1.0,1.0,1.0,3.0,3.0,3.0,3.0,3.0,3.0,5.0,5.0,4.0,4.0,4.0,5.0,5.0,5.0,5.0,5.0,25.0,22.0,6.0,53.0,2.0,3.0
1029.0,5/29/2021 23:38:40,47.0,1.0,2.0,6.0,3.0,0.0,,87.0,165.0,0.0,0.0,1.0,1.0,4.0,1.0,2.0,,3.0,1.0,5.0,3.0,2.0,1.0,1.0,1.0,1.0,1.0,1.0,3.0,1.0,2.0,3.0,3.0,4.0,2.0,3.0,3.0,3.0,1.0,3.0,2.0,3.0,4.0,3.0,4.0,2.0,1.0,3.0,1.0,3.0,3.0,2.0,4.0,3.0,15.0,13.0,4.0,32.0,2.0,3.0
1129.0,5/30/2021 14:30:35,47.0,1.0,2.0,5.0,4.0,0.0,,72.0,175.0,0.0,0.0,0.0,1.0,3.0,0.0,2.0,,2.0,5.0,1.0,2.0,4.0,3.0,2.0,1.0,1.0,1.0,1.0,3.0,3.0,2.0,4.0,3.0,4.0,5.0,4.0,3.0,3.0,3.0,4.0,4.0,3.0,1.0,4.0,4.0,3.0,4.0,3.0,2.0,2.0,3.0,2.0,1.0,3.0,11.0,21.0,5.0,37.0,2.0,3.0
851.0,5/29/2021 19:21:51,48.0,0.0,2.0,4.0,4.0,0.0,,91.0,168.0,0.0,0.0,0.0,1.0,1.0,0.0,2.0,,1.0,1.0,1.0,1.0,1.0,1.0,1.0,1.0,1.0,1.0,1.0,1.0,1.0,1.0,1.0,3.0,3.0,4.0,4.0,1.0,2.0,3.0,1.0,1.0,1.0,3.0,2.0,3.0,2.0,1.0,3.0,2.0,5.0,3.0,3.0,2.0,4.0,17.0,12.0,4.0,33.0,2.0,3.0
1238.0,5/31/2021 19:29:28,49.0,1.0,2.0,5.0,4.0,1.0,Allergia,64.0,160.0,0.0,0.0,0.0,1.0,3.0,0.0,2.0,,5.0,3.0,3.0,3.0,3.0,1.0,1.0,1.0,1.0,1.0,1.0,2.0,1.0,2.0,2.0,2.0,2.0,2.0,2.0,2.0,3.0,1.0,3.0,1.0,2.0,1.0,3.0,3.0,2.0,1.0,2.0,2.0,4.0,4.0,4.0,4.0,3.0,19.0,12.0,4.0,35.0,2.0,3.0
1386.0,6/1/2021 13:53:42,49.0,1.0,2.0,3.0,4.0,0.0,,104.0,165.0,0.0,1.0,1.0,1.0,3.0,0.0,2.0,,3.0,2.0,1.0,1.0,2.0,1.0,1.0,1.0,1.0,1.0,1.0,4.0,3.0,4.0,3.0,3.0,3.0,3.0,3.0,2.0,3.0,3.0,3.0,2.0,2.0,3.0,3.0,3.0,3.0,3.0,3.0,3.0,3.0,3.0,3.0,3.0,3.0,15.0,18.0,4.0,37.0,2.0,3.0
982.0,5/29/2021 22:19:04,50.0,0.0,2.0,5.0,2.0,1.0,magasvérnyomás,90.0,174.0,0.0,0.0,1.0,1.0,5.0,1.0,2.0,,4.0,2.0,1.0,2.0,2.0,1.0,1.0,1.0,1.0,1.0,1.0,4.0,1.0,2.0,3.0,3.0,3.0,4.0,1.0,1.0,1.0,4.0,3.0,5.0,2.0,5.0,3.0,5.0,3.0,3.0,4.0,4.0,3.0,3.0,3.0,2.0,5.0,16.0,20.0,4.0,40.0,2.0,3.0
1048.0,5/30/2021 0:28:38,50.0,1.0,2.0,3.0,4.0,0.0,,66.0,167.0,0.0,0.0,1.0,2.0,,0.0,2.0,,4.0,2.0,1.0,1.0,1.0,1.0,1.0,1.0,1.0,1.0,1.0,4.0,3.0,1.0,2.0,3.0,3.0,3.0,3.0,2.0,2.0,2.0,2.0,2.0,2.0,3.0,3.0,5.0,2.0,3.0,3.0,2.0,4.0,3.0,3.0,3.0,4.0,17.0,15.0,4.0,36.0,2.0,3.0